{"text_format":"1","workbook":"xlsx","n_sheets":13,"sheets":["Cross Tab","Maintenance Tasks","Report Task Assignment","Sheet3","XTab Detail Task Schedule","Detail Task Schedule","Maintenance Task Assignments","Property Task Managers","Contractors","Working","Questions","Positions Per Joanne","Original"],"not_rendered":{"charts":0,"images":1,"macros":1,"external_links":0,"defined_names":12,"comments":1,"pivot_tables":2},"unopened":[],"bounds":{"document_bytes":16777216,"sheet_cells":100000,"rows_first":2000,"rows_last":500,"rows_between":2000,"halvings":0,"cell_chars":16384,"cell_head_chars":4096},"cells_cut":0,"cells_raw":0,"read":"whole","date_system":"1900"}

{"sheet":"Cross Tab","index":0,"n_rows":63,"n_cols":4,"rows_kept":63,"cut":false,"hidden":false,"merged":[]}
[]
[]
["Volunteer","Task Title","UpStream Repeating","Start Month"]
["BeverlyB","T11 Check Entrance Sign for Repainting","Annual, Mar","Mar"]
[null,"T12 Dryer Vent Cleaning","Semi-Annual","Jun"]
[null,"T20 Leaky Gutter Replacement","May, Jun, Jul, Aug","Apr"]
[null,"T25 Outside Lights and Fixtures","None","Jan"]
[null,"T27 Schecule Unit Painting ","None","Mar"]
{"$rows_left_out":56}
{"sheet":"Maintenance Tasks","index":1,"n_rows":62,"n_cols":24,"rows_kept":62,"cut":false,"hidden":false,"merged":[]}
["Calc Task Key","Task Key","VACNCA Maintenance Task","UpStream Project Grouping","Position?","Scope","Scheduling","Task Title","Task Responsible","2nd Task Resp","3rd Task Resp","UpStream Status","UpStream Repeating","Season","Month/Day/Date","Frequency","UpStream Start Date","UpStream End Date","Project Notes","Working Questions & Notes","Contractor Source","Task Responsible","2nd Task Resp","3rd Task Resp"]
["T01","T01","Activity Director","Clubhouse","Y",null,null,{"$f":"B2 & \" \" &C2","v":"T01 Activity Director"},"UnAssigned","CherieT",null,"Manage","None",null,"January","A/N","2021-01-01","2021-12-31",null,null,null,"UnAssigned","CherieT"]
["T02","T02","Annual Review","Management",null,"Assoc","Scheduled","T02 Annual Review","EarlS",null,null,"Scheduled","Annual","Winter","December","Annual","2021-12-10","2021-12-20",null,"Of What? More descriptive title needed",null,"EarlS"]
["T03","T03","Back Flow Preventer Test","Grounds",null,"Assoc","Scheduled","T03 Back Flow Preventer Test","JimT","DonW",null,"Scheduled","May","Spring","May","Spring","2021-05-01","2021-05-31",null,"Larry Green 9-22-20 Yearly Routine","Blythe Plumbing BFP","JimT","DonW"]
["T04","T04","Banking ","Treasurer",null,"Assoc","As Needed","T04 Banking ","EarlS","BeverlyB",null,"As Needed","None",null,null,"Monthly","2021-01-01","2021-12-31",null,null,null,"EarlS","BeverlyB"]
["T05","T05","Bill Payments","Treasurer",null,"Assoc","As Needed","T05 Bill Payments","EarlS",null,null,"Scheduled","Monthly",null,null,"Monthly","2021-03-25","2021-03-28",null,null,null,"EarlS"]
["T06","T06","Blow Out Irrigation System","Grounds",null,"Assoc","Scheduled","T06 Blow Out Irrigation System","JimT","DonW",null,"Scheduled","Oct","Fall","October","Fall","2021-10-01","2021-10-31",null,"Larry Green 9-22-20 Yearly Routine",null,"JimT","DonW"]
["T07","T07","Budget","Treasurer",null,"Assoc","Scheduled","T07 Budget","EarlS","Committee",null,"Scheduled","Annual, Oct","Fall","October","Annual","2021-10-01","2021-11-15",null,null,null,"EarlS","Committee"]
{"$rows_left_out":55}
{"sheet":"Report Task Assignment","index":2,"n_rows":781,"n_cols":12,"rows_kept":781,"cut":false,"hidden":false,"merged":[]}
["project.title","task.title","task.assignedTo:byUsername","task.assignedTo:byName","task.responsibility","task.status","task.notes","task.startDate","task.endDate","task.progress","Task ID","TaskManager.email"]
[{"$f":"VLOOKUP($K2,'Maintenance Tasks'!$B$2:$X$61,3,FALSE)","v":"Clubhouse"},{"$f":"VLOOKUP(K2,'Maintenance Tasks'!$B$2:$X$61,7,FALSE)","v":"T01 Activity Director"},{"$f":"VLOOKUP($K2,'Maintenance Tasks'!$B$2:$X$61,3,FALSE)","v":"Clubhouse"},{"$f":"IF('Maintenance Task Assignments'!B2<>\"\", 'Maintenance Task Assignments'!A2,\"\")","v":"UnAssigned"},{"$f":"IF('Maintenance Task Assignments'!B2<>\"\", 'Maintenance Task Assignments'!D2,\"\")","v":"1st"},{"$f":"VLOOKUP($K2,'Maintenance Tasks'!$B$2:$X$61,11,FALSE)","v":"Manage"},{"$f":"\"Repeating: \" & 'Maintenance Tasks'!M2 & CHAR(10) &\n\" Project Tasks: \" & 'Maintenance Tasks'!S2 & CHAR(10) &\n\"Working Questions & Notes: \" &'Maintenance Tasks'!T2& CHAR(10) &\n\" Contractor: \" &'Maintenance Tasks'!U2","v":"Repeating: None\n Project Tasks: \nWorking Questions & Notes: \n Contractor: "},{"$f":"TEXT(VLOOKUP($K2,'Maintenance Tasks'!$B$2:$X$61,16,FALSE), \"YYYY-MM-DD\")","v":"2021-01-01"},{"$f":"TEXT(VLOOKUP($K2,'Maintenance Tasks'!$B$2:$X$61,17,FALSE), \"YYYY-MM-DD\")","v":"2021-12-31"},{"$f":"\"Repeating: \" & 'Maintenance Tasks'!M2 & CHAR(10) &\n\" Project Tasks: \" & 'Maintenance Tasks'!S2 & CHAR(10) &\n\"Working Questions & Notes: \" &'Maintenance Tasks'!T2& CHAR(10) &\n\" Contractor: \" &'Maintenance Tasks'!U2","v":"Repeating: None\n Project Tasks: \nWorking Questions & Notes: \n Contractor: "},{"$f":"IF('Maintenance Task Assignments'!B2<>\"\", 'Maintenance Task Assignments'!B2,\"\")","v":"T01"},{"$f":"IFERROR(VLOOKUP($D2,'Property Task Managers'!$A$1:$O$31,7,FALSE),\"\")","v":"VACNCABoard@gmail.com"}]
[{"$f":"VLOOKUP($K3,'Maintenance Tasks'!$B$2:$X$61,3,FALSE)","v":"Clubhouse"},{"$f":"VLOOKUP(K3,'Maintenance Tasks'!$B$2:$X$61,7,FALSE)","v":"T01 Activity Director"},{"$f":"VLOOKUP($K3,'Maintenance Tasks'!$B$2:$X$61,3,FALSE)","v":"Clubhouse"},{"$f":"IF('Maintenance Task Assignments'!B62<>\"\", 'Maintenance Task Assignments'!A62,\"\")","v":"CherieT"},{"$f":"IF('Maintenance Task Assignments'!B62<>\"\", 'Maintenance Task Assignments'!D62,\"\")","v":"2nd"},{"$f":"VLOOKUP($K3,'Maintenance Tasks'!$B$2:$X$61,11,FALSE)","v":"Manage"},{"$f":"\"Repeating: \" & 'Maintenance Tasks'!M62 & CHAR(10) &\n\" Project Tasks: \" & 'Maintenance Tasks'!S62 & CHAR(10) &\n\"Working Questions & Notes: \" &'Maintenance Tasks'!T62& CHAR(10) &\n\" Contractor: \" &'Maintenance Tasks'!U62","v":"Repeating: Monthly\n Project Tasks: Use Mmerge to send reminders\nWorking Questions & Notes: \n Contractor: "},{"$f":"TEXT(VLOOKUP($K3,'Maintenance Tasks'!$B$2:$X$61,16,FALSE), \"YYYY-MM-DD\")","v":"2021-01-01"},{"$f":"TEXT(VLOOKUP($K3,'Maintenance Tasks'!$B$2:$X$61,17,FALSE), \"YYYY-MM-DD\")","v":"2021-12-31"},{"$f":"\"Repeating: \" & 'Maintenance Tasks'!M62 & CHAR(10) &\n\" Project Tasks: \" & 'Maintenance Tasks'!S62 & CHAR(10) &\n\"Working Questions & Notes: \" &'Maintenance Tasks'!T62& CHAR(10) &\n\" Contractor: \" &'Maintenance Tasks'!U62","v":"Repeating: Monthly\n Project Tasks: Use Mmerge to send reminders\nWorking Questions & Notes: \n Contractor: "},{"$f":"IF('Maintenance Task Assignments'!B62<>\"\", 'Maintenance Task Assignments'!B62,\"\")","v":"T01"},{"$f":"IFERROR(VLOOKUP($D3,'Property Task Managers'!$A$1:$O$31,7,FALSE),\"\")","v":"cheriethomas49@comcast.net"}]
[{"$f":"VLOOKUP($K4,'Maintenance Tasks'!$B$2:$X$61,3,FALSE)","v":"Management"},{"$f":"VLOOKUP(K4,'Maintenance Tasks'!$B$2:$X$61,7,FALSE)","v":"T02 Annual Review"},{"$f":"VLOOKUP($K4,'Maintenance Tasks'!$B$2:$X$61,3,FALSE)","v":"Management"},{"$f":"IF('Maintenance Task Assignments'!B3<>\"\", 'Maintenance Task Assignments'!A3,\"\")","v":"EarlS"},{"$f":"IF('Maintenance Task Assignments'!B3<>\"\", 'Maintenance Task Assignments'!D3,\"\")","v":"1st"},{"$f":"VLOOKUP($K4,'Maintenance Tasks'!$B$2:$X$61,11,FALSE)","v":"Scheduled"},{"$f":"\"Repeating: \" & 'Maintenance Tasks'!M3 & CHAR(10) &\n\" Project Tasks: \" & 'Maintenance Tasks'!S3 & CHAR(10) &\n\"Working Questions & Notes: \" &'Maintenance Tasks'!T3& CHAR(10) &\n\" Contractor: \" &'Maintenance Tasks'!U3","v":"Repeating: Annual\n Project Tasks: \nWorking Questions & Notes: Of What? More descriptive title needed\n Contractor: "},{"$f":"TEXT(VLOOKUP($K4,'Maintenance Tasks'!$B$2:$X$61,16,FALSE), \"YYYY-MM-DD\")","v":"2021-12-10"},{"$f":"TEXT(VLOOKUP($K4,'Maintenance Tasks'!$B$2:$X$61,17,FALSE), \"YYYY-MM-DD\")","v":"2021-12-20"},{"$f":"\"Repeating: \" & 'Maintenance Tasks'!M3 & CHAR(10) &\n\" Project Tasks: \" & 'Maintenance Tasks'!S3 & CHAR(10) &\n\"Working Questions & Notes: \" &'Maintenance Tasks'!T3& CHAR(10) &\n\" Contractor: \" &'Maintenance Tasks'!U3","v":"Repeating: Annual\n Project Tasks: \nWorking Questions & Notes: Of What? More descriptive title needed\n Contractor: "},{"$f":"IF('Maintenance Task Assignments'!B3<>\"\", 'Maintenance Task Assignments'!B3,\"\")","v":"T02"},{"$f":"IFERROR(VLOOKUP($D4,'Property Task Managers'!$A$1:$O$31,7,FALSE),\"\")","v":"ecsheneman@msn.com"}]
[{"$f":"VLOOKUP($K5,'Maintenance Tasks'!$B$2:$X$61,3,FALSE)","v":"Grounds"},{"$f":"VLOOKUP(K5,'Maintenance Tasks'!$B$2:$X$61,7,FALSE)","v":"T03 Back Flow Preventer Test"},{"$f":"VLOOKUP($K5,'Maintenance Tasks'!$B$2:$X$61,3,FALSE)","v":"Grounds"},{"$f":"IF('Maintenance Task Assignments'!B4<>\"\", 'Maintenance Task Assignments'!A4,\"\")","v":"JimT"},{"$f":"IF('Maintenance Task Assignments'!B4<>\"\", 'Maintenance Task Assignments'!D4,\"\")","v":"1st"},{"$f":"VLOOKUP($K5,'Maintenance Tasks'!$B$2:$X$61,11,FALSE)","v":"Scheduled"},{"$f":"\"Repeating: \" & 'Maintenance Tasks'!M4 & CHAR(10) &\n\" Project Tasks: \" & 'Maintenance Tasks'!S4 & CHAR(10) &\n\"Working Questions & Notes: \" &'Maintenance Tasks'!T4& CHAR(10) &\n\" Contractor: \" &'Maintenance Tasks'!U4","v":"Repeating: May\n Project Tasks: \nWorking Questions & Notes: Larry Green 9-22-20 Yearly Routine\n Contractor: Blythe Plumbing BFP"},{"$f":"TEXT(VLOOKUP($K5,'Maintenance Tasks'!$B$2:$X$61,16,FALSE), \"YYYY-MM-DD\")","v":"2021-05-01"},{"$f":"TEXT(VLOOKUP($K5,'Maintenance Tasks'!$B$2:$X$61,17,FALSE), \"YYYY-MM-DD\")","v":"2021-05-31"},{"$f":"\"Repeating: \" & 'Maintenance Tasks'!M4 & CHAR(10) &\n\" Project Tasks: \" & 'Maintenance Tasks'!S4 & CHAR(10) &\n\"Working Questions & Notes: \" &'Maintenance Tasks'!T4& CHAR(10) &\n\" Contractor: \" &'Maintenance Tasks'!U4","v":"Repeating: May\n Project Tasks: \nWorking Questions & Notes: Larry Green 9-22-20 Yearly Routine\n Contractor: Blythe Plumbing BFP"},{"$f":"IF('Maintenance Task Assignments'!B4<>\"\", 'Maintenance Task Assignments'!B4,\"\")","v":"T03"},{"$f":"IFERROR(VLOOKUP($D5,'Property Task Managers'!$A$1:$O$31,7,FALSE),\"\")","v":"jim@tragesser.net   "}]
[{"$f":"VLOOKUP($K6,'Maintenance Tasks'!$B$2:$X$61,3,FALSE)","v":"Grounds"},{"$f":"VLOOKUP(K6,'Maintenance Tasks'!$B$2:$X$61,7,FALSE)","v":"T03 Back Flow Preventer Test"},{"$f":"VLOOKUP($K6,'Maintenance Tasks'!$B$2:$X$61,3,FALSE)","v":"Grounds"},{"$f":"IF('Maintenance Task Assignments'!B63<>\"\", 'Maintenance Task Assignments'!A63,\"\")","v":"DonW"},{"$f":"IF('Maintenance Task Assignments'!B63<>\"\", 'Maintenance Task Assignments'!D63,\"\")","v":"2nd"},{"$f":"VLOOKUP($K6,'Maintenance Tasks'!$B$2:$X$61,11,FALSE)","v":"Scheduled"},{"$f":"\"Repeating: \" & 'Maintenance Tasks'!M63 & CHAR(10) &\n\" Project Tasks: \" & 'Maintenance Tasks'!S63 & CHAR(10) &\n\"Working Questions & Notes: \" &'Maintenance Tasks'!T63& CHAR(10) &\n\" Contractor: \" &'Maintenance Tasks'!U63","v":"Repeating: \n Project Tasks: \nWorking Questions & Notes: \n Contractor: "},{"$f":"TEXT(VLOOKUP($K6,'Maintenance Tasks'!$B$2:$X$61,16,FALSE), \"YYYY-MM-DD\")","v":"2021-05-01"},{"$f":"TEXT(VLOOKUP($K6,'Maintenance Tasks'!$B$2:$X$61,17,FALSE), \"YYYY-MM-DD\")","v":"2021-05-31"},{"$f":"\"Repeating: \" & 'Maintenance Tasks'!M63 & CHAR(10) &\n\" Project Tasks: \" & 'Maintenance Tasks'!S63 & CHAR(10) &\n\"Working Questions & Notes: \" &'Maintenance Tasks'!T63& CHAR(10) &\n\" Contractor: \" &'Maintenance Tasks'!U63","v":"Repeating: \n Project Tasks: \nWorking Questions & Notes: \n Contractor: "},{"$f":"IF('Maintenance Task Assignments'!B63<>\"\", 'Maintenance Task Assignments'!B63,\"\")","v":"T03"},{"$f":"IFERROR(VLOOKUP($D6,'Property Task Managers'!$A$1:$O$31,7,FALSE),\"\")","v":"searigg@comcast.net"}]
[{"$f":"VLOOKUP($K7,'Maintenance Tasks'!$B$2:$X$61,3,FALSE)","v":"Treasurer"},{"$f":"VLOOKUP(K7,'Maintenance Tasks'!$B$2:$X$61,7,FALSE)","v":"T04 Banking "},{"$f":"VLOOKUP($K7,'Maintenance Tasks'!$B$2:$X$61,3,FALSE)","v":"Treasurer"},{"$f":"IF('Maintenance Task Assignments'!B5<>\"\", 'Maintenance Task Assignments'!A5,\"\")","v":"EarlS"},{"$f":"IF('Maintenance Task Assignments'!B5<>\"\", 'Maintenance Task Assignments'!D5,\"\")","v":"1st"},{"$f":"VLOOKUP($K7,'Maintenance Tasks'!$B$2:$X$61,11,FALSE)","v":"As Needed"},{"$f":"\"Repeating: \" & 'Maintenance Tasks'!M5 & CHAR(10) &\n\" Project Tasks: \" & 'Maintenance Tasks'!S5 & CHAR(10) &\n\"Working Questions & Notes: \" &'Maintenance Tasks'!T5& CHAR(10) &\n\" Contractor: \" &'Maintenance Tasks'!U5","v":"Repeating: None\n Project Tasks: \nWorking Questions & Notes: \n Contractor: "},{"$f":"TEXT(VLOOKUP($K7,'Maintenance Tasks'!$B$2:$X$61,16,FALSE), \"YYYY-MM-DD\")","v":"2021-01-01"},{"$f":"TEXT(VLOOKUP($K7,'Maintenance Tasks'!$B$2:$X$61,17,FALSE), \"YYYY-MM-DD\")","v":"2021-12-31"},{"$f":"\"Repeating: \" & 'Maintenance Tasks'!M5 & CHAR(10) &\n\" Project Tasks: \" & 'Maintenance Tasks'!S5 & CHAR(10) &\n\"Working Questions & Notes: \" &'Maintenance Tasks'!T5& CHAR(10) &\n\" Contractor: \" &'Maintenance Tasks'!U5","v":"Repeating: None\n Project Tasks: \nWorking Questions & Notes: \n Contractor: "},{"$f":"IF('Maintenance Task Assignments'!B5<>\"\", 'Maintenance Task Assignments'!B5,\"\")","v":"T04"},{"$f":"IFERROR(VLOOKUP($D7,'Property Task Managers'!$A$1:$O$31,7,FALSE),\"\")","v":"ecsheneman@msn.com"}]
[{"$f":"VLOOKUP($K8,'Maintenance Tasks'!$B$2:$X$61,3,FALSE)","v":"Treasurer"},{"$f":"VLOOKUP(K8,'Maintenance Tasks'!$B$2:$X$61,7,FALSE)","v":"T04 Banking "},{"$f":"VLOOKUP($K8,'Maintenance Tasks'!$B$2:$X$61,3,FALSE)","v":"Treasurer"},{"$f":"IF('Maintenance Task Assignments'!B64<>\"\", 'Maintenance Task Assignments'!A64,\"\")","v":"BeverlyB"},{"$f":"IF('Maintenance Task Assignments'!B64<>\"\", 'Maintenance Task Assignments'!D64,\"\")","v":"2nd"},{"$f":"VLOOKUP($K8,'Maintenance Tasks'!$B$2:$X$61,11,FALSE)","v":"As Needed"},{"$f":"\"Repeating: \" & 'Maintenance Tasks'!M64 & CHAR(10) &\n\" Project Tasks: \" & 'Maintenance Tasks'!S64 & CHAR(10) &\n\"Working Questions & Notes: \" &'Maintenance Tasks'!T64& CHAR(10) &\n\" Contractor: \" &'Maintenance Tasks'!U64","v":"Repeating: \n Project Tasks: \nWorking Questions & Notes: \n Contractor: "},{"$f":"TEXT(VLOOKUP($K8,'Maintenance Tasks'!$B$2:$X$61,16,FALSE), \"YYYY-MM-DD\")","v":"2021-01-01"},{"$f":"TEXT(VLOOKUP($K8,'Maintenance Tasks'!$B$2:$X$61,17,FALSE), \"YYYY-MM-DD\")","v":"2021-12-31"},{"$f":"\"Repeating: \" & 'Maintenance Tasks'!M64 & CHAR(10) &\n\" Project Tasks: \" & 'Maintenance Tasks'!S64 & CHAR(10) &\n\"Working Questions & Notes: \" &'Maintenance Tasks'!T64& CHAR(10) &\n\" Contractor: \" &'Maintenance Tasks'!U64","v":"Repeating: \n Project Tasks: \nWorking Questions & Notes: \n Contractor: "},{"$f":"IF('Maintenance Task Assignments'!B64<>\"\", 'Maintenance Task Assignments'!B64,\"\")","v":"T04"},{"$f":"IFERROR(VLOOKUP($D8,'Property Task Managers'!$A$1:$O$31,7,FALSE),\"\")","v":"searigg@comcast.net"}]
{"$rows_left_out":774}
{"sheet":"Sheet3","index":3,"n_rows":12,"n_cols":3,"rows_kept":12,"cut":false,"hidden":false,"merged":[]}
["Calculated Field"]
["Solve Order","Field","Formula"]
[]
["Calculated Item"]
["Solve Order","Item","Formula"]
[]
[]
["Note:","When a cell is updated by more than one formula,"]
{"$rows_left_out":5}
{"sheet":"XTab Detail Task Schedule","index":4,"n_rows":31,"n_cols":7,"rows_kept":31,"cut":false,"hidden":false,"merged":[]}
["Task Manager","(All)",null,"May 2021"]
["Scheduled","Scheduled","2021 Task By Month"]
["Start Date","End Date","Date Completed","Completing Task Manager ","General Task","Scheduale Frequecy","Schedule Period"]
["2021-05-01","2021-05-28","(blank)","(blank)","T03 01-2021 Back Flow Preventer Test","Spring","May"]
["2021-05-01","2021-05-28","(blank)",null,"T04 05-2021 Banking ","Monthly","(blank)"]
["2021-05-01","2021-05-28","(blank)",null,"T05 05-2021 Bill Payments","Monthly","(blank)"]
["2021-05-01","2021-05-28","(blank)",null,"T09 05-2021 Carpet Cleaning","Bi-Monthly","Every Other Mo"]
["2021-05-01","2021-05-28","(blank)",null,"T18 05-2021 General Cleaning","Bi-Monthly","Every Other Mo"]
{"$rows_left_out":24}
{"sheet":"Detail Task Schedule","index":5,"n_rows":354,"n_cols":21,"rows_kept":354,"cut":false,"hidden":false,"merged":[]}
["Scheduled Task","Schedule Season","Schedule Period","Scheduale Frequecy","Start Date","End Date","General Task","Date Completed","Completing Task Manager ","project.title","task.title","task.assignedTo:byUsername","task.assignedTo:byName","task.responsibility","task.status","task.notes","task.startDate","task.endDate","task.progress","Task ID","TaskManager.email"]
["T01 01-2021",null,"January","A/N","2021-01-01","2021-01-28","T01 01-2021 Activity Director",null,null,null,"Clubhouse","UnAssigned",null,1,null,null,null,null,null,null,"VACNCABoard@gmail.com"]
["T01 01-2021",null,"January","A/N","2021-01-01","2021-01-28","T01 01-2021 Activity Director",null,null,null,"Clubhouse","CherieT",null,2,null,null,null,null,null,null,false]
["T02 01-2021","Winter","December","Annual","2021-12-01","2021-12-28","T02 01-2021 Annual Review",null,null,null,"Management","EarlS",null,1,null,null,null,null,null,null,"ecsheneman@msn.com"]
["T03 01-2021","Spring","May","Spring","2021-05-01","2021-05-28","T03 01-2021 Back Flow Preventer Test",null,null,null,"Grounds","JimT",null,1,null,null,null,null,null,null,"jim@tragesser.net   "]
["T03 01-2021","Spring","May","Spring","2021-05-01","2021-05-28","T03 01-2021 Back Flow Preventer Test",null,null,null,"Grounds","DonW",null,2,null,null,null,null,null,null,true]
["T04 01-2021",null,null,"Monthly","2021-01-01","2021-01-28","T04 01-2021 Banking ",null,null,null,"Treasurer","EarlS",null,1,null,null,null,null,null,null,"ecsheneman@msn.com"]
["T04 01-2021",null,null,"Monthly","2021-01-01","2021-01-28","T04 01-2021 Banking ",null,null,null,"Treasurer","BeverlyB",null,2,null,null,null,null,null,null,false]
{"$rows_left_out":347}
{"sheet":"Maintenance Task Assignments","index":6,"n_rows":96,"n_cols":4,"rows_kept":96,"cut":false,"hidden":false,"merged":[]}
["PersonID","Task ID","Person Name","Person Alternate Level"]
["UnAssigned","T01","UnAssignec, Board","1st"]
["EarlS","T02","Sheneman, Earl","1st"]
["JimT","T03","Tragesser, Jim","1st"]
["EarlS","T04","Sheneman, Earl","1st"]
["EarlS","T05","Sheneman, Earl","1st"]
["JimT","T06","Tragesser, Jim","1st"]
["EarlS","T07","Sheneman, Earl","1st"]
{"$rows_left_out":89}
{"sheet":"Property Task Managers","index":7,"n_rows":22,"n_cols":10,"rows_kept":22,"cut":false,"hidden":false,"merged":[]}
["User Id","Property Task Manager Resident Key","PTM Name \nLast, First","Unit ","Main Phone","Cell Phone","Email","User Id","Password"]
["BeverlyB","1243-BROWNRIGG-BEVERLY","Brownrigg, Beverly",1243,"739-5388","739-5388","searigg@comcast.net",{"$f":"A2","v":"BeverlyB"},"beverlyb:circle"]
["CarlG","1206-GRANT-CARL","Grant, Carl",1206,"650-9249","603-0564","grant_carl@hotmail.com",{"$f":"A3","v":"CarlG"},"carlg:circle"]
["CharlotteM","1212-MARTIN-CHARLOTTE","Martin, Charlotte",1212,"656-5774",0,"clakelimerick@msn.com",{"$f":"A4","v":"CharlotteM"},"charlottem:circle"]
["CherieT","1207-THOMAS-CHERIE","Thomas, Cherie",1207,"380-2097","303-9930","cheriethomas49@comcast.net",{"$f":"A5","v":"CherieT"},"cheriet:circle"]
["CherylS","1224-SCHEELE-CHERYL","Scheele, Cheryl",1224,"961-0680","961-0680","mamacheryl04@gmail.com",{"$f":"A6","v":"CherylS"},"cheryl:circle"]
["DaleB","1243-BROWNRIGG-BEVERLY","Brownrigg, Beverly",1243,"739-5388","739-5388","searigg@comcast.net",{"$f":"A7","v":"DaleB"},"***"]
["DonW","1243-BROWNRIGG-BEVERLY","Brownrigg, Beverly",1243,"739-5388","739-5388","searigg@comcast.net",{"$f":"A8","v":"DonW"},"***"]
{"$rows_left_out":15}
{"sheet":"Contractors","index":8,"n_rows":22,"n_cols":11,"rows_kept":22,"cut":false,"hidden":false,"merged":[]}
["Notes:","Contractor ID","Contractor Company Name","Contractor General Function","Contractor Special Function","Contractor Representative Name","Contractor Representative Phone","Contractor Company Phone Number","Contractor Mailing Address","Contractor Web site","Contractor Email"]
[null,null,"Andgar Heating & Air Cond","Heating & Air Conditioning","Dryer Vent Cleaning",null,null,"360.366.9900","6920 Salashan Pkwy. A-102, PO Box 2708, Ferndale, WA 98248","Heating and Air Conditioning Company"," "]
["Preferred",null,"Beaties Mobil Lock Service","Locks",null,null,null,"671-5597",null,null," "]
[null,null,"Blythe plumbing","Back flow preventer testing",null,null,null,null,null,null," "]
[null,null,"Braam Construction Inc","General Contractor",null,"Dale Braam",null,null," 5056 Wahl Rd, Bellingham, WA","None"," "]
[null,null,"Coast Insulation","Insulation repair",null,"Clark Casey","815-6577","366-3472",null,null," "]
[null,null,"Country Glass & Door","Windows",null,"Doug Lankharr","303-1004 cell","354-4287",null,null," "]
[null,"DonW","Custom Cut Landscaping & Irrigation","Grounds Maintenance",null,"Don Waters","756-1188 cell",null,null,null,"sturg237@gmail.com"]
{"$rows_left_out":15}
{"sheet":"Working","index":9,"n_rows":63,"n_cols":5,"rows_kept":63,"cut":false,"hidden":false,"merged":[]}
[]
[]
[null,"Task Responsible","Task Title","2nd Task Resp","3rd Task Resp"]
[null,"BeverlyB","T11 Check Entrance Sign for Repainting","JoanneW"]
[null,null,"T12 Dryer Vent Cleaning"]
[null,null,"T20 Leaky Gutter Replacement","DaleB"]
[null,null,"T25 Outside Lights and Fixtures","RonR"]
[null,null,"T27 Schecule Unit Painting ","JoanneW"]
{"$rows_left_out":56}
{"sheet":"Questions","index":10,"n_rows":1,"n_cols":1,"rows_kept":1,"cut":false,"hidden":false,"merged":[]}
["Questions"]

{"sheet":"Positions Per Joanne","index":11,"n_rows":56,"n_cols":11,"rows_kept":56,"cut":false,"hidden":false,"merged":[]}
["Tentaive Number","VACNCA Maintenance Task","Current Vendor \n(do not call direct)","Position","Scheduling",null,"Season","Month","VACNCA Volunteers","Primary Volunteer","Alternate Volunteer"]
[32,"Annual Review",null,null,"As Needed","As Needed",null,null,"Earl Sheneman/",{"$f":"IFERROR(LEFT(I2,FIND(\"/\",I2)-1),\"\")","v":"Earl Sheneman"},{"$f":"TRIM(RIGHT(SUBSTITUTE(I2,\"/\",REPT(\" \",200)),200))","v":""}]
[50,"CC&R's, By-laws & Rules & Reg","Attorney Thulin",null,null,null,null,null,"JoAnne Wyatt/Marie Bishop/Linda Sheeks","JoAnne Wyatt","Linda Sheeks"]
[19,"CH  Activity Director ",null,"Y",null,null,null,null,"Cherie Thomas","","Cherie Thomas"]
[22,"CH check fire extingisher","Security Solutions",null,"Scheduled","Fall","Fall",null,"Sheila Johansen/","Sheila Johansen",""]
[15,"CH Empty Trash",null,null,"Scheduled","Weekly",null,null,"Nettie Post/","Nettie Post",""]
[23,"CH furnace, AC and fireplace ","Lynden Sheet Metal",null,"Scheduled","Fall","Fall",null,"Sheila Johansen/","Sheila Johansen",""]
[13,"CH Library",null,null,"As Needed","As Needed",null,null,"Sheila Johansen/","Sheila Johansen",""]
{"$rows_left_out":49}
{"sheet":"Original","index":12,"n_rows":67,"n_cols":4,"rows_kept":67,"cut":false,"hidden":false,"merged":[]}
["VACNCA Work Orders","Vendor (do not call direct)","Time","VACNCA #"]
[]
["Gutters - replacement/schedule","Whatcom Gutters","A/T","Bev/Dale"]
["Roof replacement. Scheduled","Mount Baker Roofing","A/T","Bev/Dale"]
["Roof treatment for moss","Mount Baker Roofing","Fall","Bev/Dale"]
["Street -Curb repairs",null,"A/T","Bev/Dale"]
["Street -Seal coat","Kamps","A/T","Bev/Dale"]
["Window replacement -Doug","Bev/Doug Lankhar","A/T","Bev/Linda Skeeks"]
{"$rows_left_out":59}